{"text_format":"1","workbook":"xlsx","n_sheets":7,"sheets":["instrukcja","ESG","Progi istotności","AMA","PKD","Słowniki","EBRD_PKD_ESG risk"],"not_rendered":{"charts":0,"images":2,"macros":1,"external_links":1,"defined_names":6,"comments":1,"pivot_tables":0},"unopened":[],"bounds":{"document_bytes":16777216,"sheet_cells":100000,"rows_first":2000,"rows_last":500,"rows_between":2000,"halvings":0,"cell_chars":16384,"cell_head_chars":4096},"cells_cut":0,"cells_raw":0,"read":"whole","date_system":"1900"}

{"sheet":"instrukcja","index":0,"n_rows":32,"n_cols":3,"rows_kept":32,"cut":false,"hidden":false,"merged":[[26,1,26,2],[5,1,5,2],[4,1,4,2],[3,1,3,2],[11,1,11,2],[20,1,20,2],[12,1,12,2],[13,1,13,2],[14,1,14,2],[15,1,15,2],[16,1,16,2],[17,1,17,2],[18,1,18,2],[19,1,19,2],[31,1,31,2],[27,1,27,2],[28,1,28,2],[29,1,29,2],[30,1,30,2]]}
[]
[null,"Instrukcja pracy z plikiem"]
[]
[1,"Pracownik Banku pracuje w ramach niniejszego pliku na arkuszu o nazwie ESG"]
[2,"Arkusz ESG należy wypełnić dla każdego klienta, na etapie wnioskowania przez klienta o kredyt/ produkt generujący ryzyko kredytowe / zmianę warunków istniejącej umowy kredytowej, w sytuacji gdy od ostatniej oceny ryzyka ESG klienta (od ostatniego wypełnienia dla klienta arkusza ESG) upłynął co najmniej 1 rok."]
[3,"W pierwszej kolejności w arkuszu ESG należy wskazać segment (wg klasyfikacji unijnej), do jakiego należy klient wg skali / rozmiaru jego działalności biznesowej. Słownik segmentów dostępnych do wyboru w arkuszu ESG wskazano w tabeli poniżej."]
[null,"Segment klienta","Definicja segmentu"]
[null,"duży","klient zatrudniający co najmniej 250 osób oraz którego obroty roczne wynoszą więcej niż 50 mln EUR lub którego roczna suma bilansowa jest wyższa niż 43 mln EUR"]
[null,"średni","klient zatrudniający 50-249 osób oraz o obrotach rocznych pomiędzy 10 mln EUR a 50 mln EUR lub roczną sumą bilansową pomiędzy 10 mln EUR a 43 mln EUR"]
[null,"mały","klient zatrudniający mniej niż 50 osób oraz którego obroty roczne lub roczna suma bilansowa nie przekracza 10 mln EUR"]
[]
[4,"W arkuszu ESG należy uzupełnić sekcję \"Formularz klienta\", w tym: "]
[null,"a. nazwę klienta"]
[null,"b. REGON"]
[null,"c. datę wniosku (przycisk wstawia datę dzisiejszą)"]
[null,"d. pracownika wypełniającego"]
[null,"e. segment klienta (zgodnie z powyższą tabelą)"]
[null,"f. kod PKD wiodącej działalności gospodarczej klienta - do wyboru z listy rozwijanej (jeśli klient nie zna kodu, można go wyszukać w arkuszu PKD)"]
[5,"W arkuszu automatycznie zostanie wyświetlona ocena potencjalnego ryzyka ESG wybranego kodu PKD (w kom. C10)"]
[6,"Tabela Wskaźniki do pobrania na potrzeby ujawnień III filara, jest elementem stałym arkusza i należy ją wypełnić dla każdego klienta.\nJeśli na pytanie 3 lub 4 udzielono odpowiedzi TAK, w polu poniżej danego pytania należy zaznaczyć, które z ryzyk miały wpływ na klienta."]
{"$rows_left_out":13}
{"sheet":"ESG","index":1,"n_rows":129,"n_cols":26,"rows_kept":129,"cut":false,"hidden":false,"merged":[[7,2,8,3],[5,5,5,6],[16,2,16,4],[18,2,18,4],[13,2,13,4],[14,2,14,4],[15,2,15,4],[6,5,6,6],[7,5,8,6],[0,1,0,3],[35,1,35,4],[23,5,23,6],[23,1,23,2],[24,1,24,2],[24,5,24,6],[1,1,1,3],[2,2,2,3],[3,2,3,3],[12,1,12,6],[14,1,15,1],[11,1,11,6],[9,2,9,3],[5,2,5,3],[6,2,6,3],[7,1,8,1],[36,1,36,6],[37,1,37,4],[38,1,38,6],[39,1,39,4],[40,1,40,6],[41,1,41,4],[42,1,42,6],[43,1,43,4],[44,1,44,6],[45,1,45,4],[55,1,55,2],[55,5,55,6],[56,1,56,2],[56,5,56,6],[70,1,70,4],[71,1,71,6],[72,1,72,4],[73,1,73,4],[78,1,78,4],[79,1,79,4],[75,1,75,4],[77,1,77,4],[74,1,74,4],[76,1,76,4],[81,1,81,6],[82,1,82,4],[84,1,84,6],[85,1,85,4],[87,1,87,6],[95,1,95,4],[96,1,96,4],[97,1,97,6],[98,1,98,4],[88,1,88,4],[89,1,89,4],[90,1,90,4],[91,1,91,6],[92,1,92,4],[94,1,94,6],[117,1,117,6],[118,1,118,4],[109,1,109,4],[110,1,110,4],[111,1,111,6],[112,1,112,4],[113,1,113,6],[114,1,114,4],[115,1,115,6],[116,1,116,4],[104,1,104,4],[105,1,105,6],[106,1,106,4],[107,1,107,4],[108,1,108,4],[99,1,99,6],[100,1,100,4],[101,1,101,4],[102,1,102,4],[103,1,103,4],[127,1,127,2],[127,5,127,6],[128,1,128,2],[128,5,128,6],[17,1,17,6],[19,1,19,6],[29,1,32,4],[64,1,67,4],[33,2,33,3],[80,1,80,4],[83,1,83,4],[86,1,86,4],[93,1,93,4],[119,1,119,4],[120,1,120,6],[121,1,121,4]]}
[null,"OCENA ISTOTNOŚCI RYZYKA ESG KLIENTA",null,null,null,null,null,null,null,"kolumna techniczna","kolumna techniczna","kolumna techniczna","kolumna techniczna","kolumna techniczna","kolumna techniczna","kolumna techniczna","kolumna techniczna","kolumna techniczna",null,null,"wydruk nazwa","ArkESG_REGON/PESEL_Nazwa_DATA",null,null,null,{"$f":"CONCATENATE(\"ArkESG_\",C4,\"_\",LEFT(C3,10),\"_\",TEXT(NOW(),\"rrrrMMdd\"))","v":"ArkESG___20220916"}]
[null,"FORMULARZ KLIENTA",null,null,null,"WYNIK OCENY ISTOTNOŚCI RYZYKA ESG",{"$f":"IF(OR(C3=\"\",C4=\"\",C5=\"\",C6=\"\",C7=\"\",C8=\"\"),\"UZUPEŁNIJ FORMULARZ KLIENTA\",\nIF(OR(F8=\"Uzupełnij tabelę Wskaźniki do pobrania na potrzeby analizy istotności ryzyka ESG - segment duży\",F8=\"Uzupełnij tabelę Wskaźniki do pobrania na potrzeby analizy istotności ryzyka ESG - segment mikro/mały/średni\",F7=\"Uzupełnij wskaźniki do pobrania na potrzeby ujawnień III filara\"),\"NIEKOMPLETNE DANE\",\nIF(F6=\"BRAK KONIECZNOŚCI PRZEPROWADZENIA ANALIZY ISTOTNOŚCI RYZYKA ESG\",\"BRAK PODWYŻSZONEGO RYZYKA ESG\",\nIF(C7=\"DUŻY\",N9,N2))))","v":"UZUPEŁNIJ FORMULARZ KLIENTA"},null,null,null,null,null,"ŚREDNIE",{"$f":"IF(N7>=N3,IF(C7=\"ŚREDNI\",\"PODWYŻSZONE RYZYKO ESG - wymagana analiza wrażliwości zdolności kredytowej na poziomie ekspozycji\",\"PODWYŻSZONE RYZYKO ESG - zweryfikuj w Podręczniku kredytowym, czy wymagana jest analiza wrażliwości na poziomie ekspozycji\"),\"BRAK PODWYŻSZONEGO RYZYKA ESG\")","v":"BRAK PODWYŻSZONEGO RYZYKA ESG"}]
[null,"Nazwa klienta",null,null,null,"Ryzyko środowiskowe (\"E\")",{"$f":"IF(G2=\"UZUPEŁNIJ FORMULARZ KLIENTA\",\"nie dotyczy\",IF(G2=\"BRAK PODWYŻSZONEGO RYZYKA ESG\",\"nie dotyczy\",IF(OR(G2=\"NIEKOMPLETNE DANE\",G2=\"BRAK PODWYŻSZONEGO RYZYKA ESG\"),\"nie dotyczy\",IF(OR(C7=\"ŚREDNI\",C7=\"MAŁY/MIKRO\"),IF(N4>='Progi istotności'!D5/2,\"Podwyższone ryzyko\",\"nie dotyczy\"),IF(OR(P11>=Q11,R11>='Progi istotności'!D9),\"Podwyższone ryzyko\",\"nie dotyczy\")))))","v":"nie dotyczy"},null,null,null,null,null,"próg istotności",{"$f":"'Progi istotności'!D5","v":2}]
[null,"REGON",null,null,null,"Ryzyko społeczne (\"S\")",{"$f":"IF(G2=\"UZUPEŁNIJ FORMULARZ KLIENTA\",\"nie dotyczy\",IF(G2=\"BRAK PODWYŻSZONEGO RYZYKA ESG\",\"nie dotyczy\",IF(OR(G2=\"NIEKOMPLETNE DANE\",G2=\"BRAK PODWYŻSZONEGO RYZYKA ESG\"),\"nie dotyczy\",IF(OR(C7=\"ŚREDNI\",C7=\"MAŁY/MIKRO\"),IF(N5>='Progi istotności'!D5/2,\"Podwyższone ryzyko\",\"nie dotyczy\"),IF(OR(P12>=Q12,R12>='Progi istotności'!D9),\"Podwyższone ryzyko\",\"nie dotyczy\")))))","v":"nie dotyczy"},null,null,null,null,null,"E",{"$f":"IF(OR(G17=\"\",G17=\"nie dotyczy\"),0,G17+IF(OR(G19=\"\",G19=\"nie dotyczy\"),0,G19))+IF(G38<>\"\",G38,0)+IF(G40<>\"\",G40,0)","v":0}]
[null,"Data wniosku",null,null,null,"Ryzyko związane z zarządzaniem (\"G\")",{"$f":"IF(G2=\"UZUPEŁNIJ FORMULARZ KLIENTA\",\"nie dotyczy\",IF(G2=\"BRAK PODWYŻSZONEGO RYZYKA ESG\",\"nie dotyczy\",IF(OR(G2=\"NIEKOMPLETNE DANE\",G2=\"BRAK PODWYŻSZONEGO RYZYKA ESG\"),\"nie dotyczy\",IF(OR(C7=\"ŚREDNI\",C7=\"MAŁY/MIKRO\"),IF(N6>='Progi istotności'!D5/2,\"Podwyższone ryzyko\",\"nie dotyczy\"),IF(OR(P13>=Q13,R13>='Progi istotności'!D9),\"Podwyższone ryzyko\",\"nie dotyczy\")))))","v":"nie dotyczy"},null,null,null,null,null,"S",{"$f":"IF(G42<>\"\",G42,0)+IF(G44<>\"\",G44,0)","v":0}]
[null,"Pracownik wypełniający",null,null,null,{"$f":"IF(AND(C7=\"mały/mikro\",C10=\"nie\"),\"BRAK KONIECZNOŚCI PRZEPROWADZENIA ANALIZY ISTOTNOŚCI RYZYKA ESG\",\"\")","v":""},null,null,null,"firma+branże",null,null,"G",{"$f":"IF(G46<>\"\",G46,0)","v":0}]
[null,"Segment klienta",null,null,null,{"$f":"IF(OR(F17=\"\",F19=\"\",F15=\"\",F16=\"\"),\"Uzupełnij Wskaźniki do pobrania na potrzeby ujawnień III filara\",\"\")","v":"Uzupełnij Wskaźniki do pobrania na potrzeby ujawnień III filara"},null,null,null,{"$f":"IF(AND(OR(C7=\"mały/mikro\",C7=\"\"),C10=\"b.d.\"),4,IF(C7=\"duży\",1,IF(C7=\"średni\",2,IF(AND(OR(C7=\"mały/mikro\"),C10=\"tak\"),3,0))))","v":4},null,null,"suma ESG",{"$f":"SUM(N4:N6)","v":0}]
[null,"PKD wiodącej działalności gospodarczej",null,null,null,{"$f":"IF(C7=\"DUŻY\",IF(P72>0,\"Uzupełnij tabelę Wskaźniki do pobrania na potrzeby analizy istotności ryzyka ESG - segment duży\",\"\"),IF(J7=2,IF(OR(F38=\"\",F40=\"\",F42=\"\",F44=\"\",F46=\"\"),\"Uzupełnij tabelę Wskaźniki do pobrania na potrzeby analizy istotności ryzyka ESG - segment mikro/mały/średni\",\"\"),IF(AND(C7=\"MAŁY/MIKRO\",C10=\"tak\"),IF(OR(F38=\"\",F40=\"\",F42=\"\",F44=\"\",F46=\"\"),\"Uzupełnij tabelę Wskaźniki do pobrania na potrzeby analizy istotności ryzyka ESG - segment mikro/mały/średni\",\"\"),\"\")))","v":""}]
[null,null,null,null,null,null,null,null,null,null,null,null,"DUŻE",{"$f":"IF(OR(P11>=Q11,P12>=Q12,P13>=Q13,R14>='Progi istotności'!D9),\"PODWYŻSZONE RYZYKO ESG - wymagana analiza wrażliwości zdolności kredytowej na poziomie ekspozycji\",\"BRAK PODWYŻSZONEGO RYZYKA ESG\")","v":"BRAK PODWYŻSZONEGO RYZYKA ESG"}]
[null,"Czy branża charakteryzuje się podwyższonym ryzykiem ESG?",{"$f":"IFERROR(VLOOKUP(LEFT($C$8,5),'EBRD_PKD_ESG risk'!$C$4:$J$410,8,0),IFERROR(VLOOKUP(LEFT($C$8,4),'EBRD_PKD_ESG risk'!$C$4:$J$410,8,0),IFERROR(VLOOKUP(LEFT($C$8,2),'EBRD_PKD_ESG risk'!$C$4:$J$410,8,0),\"b.d.\")))","v":"b.d."},null,null,null,null,null,null,null,null,null,null,"SUMA","MAX","%","PROGI ISTOTNOŚCI","KONTROWERSJE"]
[null,null,null,null,null,null,null,null,null,null,null,null,"E",{"$f":"IF(OR(G17=\"\",G17=\"nie dotyczy\"),0,G17+IF(OR(G19=\"\",G19=\"nie dotyczy\"),0,G19))+IF(G73<>\"\",G73,0)+IF(G75<>\"\",G75,0)+IF(G77<>\"\",G77,0)+IF(G80<>\"\",G80,0)+IF(G83<>\"\",G83,0)+IF(G86<>\"\",G86,0)+IF(G89<>\"\",G89,0)+IF(G90<>\"\",G90,0)+IF(G91<>\"\",G91,0)+IF(G93<>\"\",G93,0)+IF(G96<>\"\",G96,0)+IF(G97<>\"\",G97,0)","v":0},15,{"$f":"N11/O11","v":0},{"$f":"'Progi istotności'!D6","v":0.3},{"$f":"G99","v":""}]
[null,"Wskaźniki do pobrania na potrzeby ujawnień III filara:",null,null,null,null,null,null,null,null,null,null,"S",{"$f":"SUM(G101:G105)+SUM(G107:G111)","v":0},6,{"$f":"N12/O12","v":0},{"$f":"'Progi istotności'!D7","v":0.3},{"$f":"G113","v":""}]
[null,"GRUPA - Environmental",null,null,null,null,null,null,null,null,null,null,"G",{"$f":"IF(G115<>\"\",G115,0)+IF(G117<>\"\",G117,0)+IF(G119<>\"\",G119,0)+IF(G120<>\"\",G120,0)","v":0},2,0,{"$f":"'Progi istotności'!D8","v":0.5},{"$f":"G122","v":""}]
[null,"PODGRUPA","WSKAŹNIK ESG ",null,null,"ODPOWIEDŹ","PUNKTY ESG",null,null,null,null,null,"suma ESG",{"$f":"SUM(N11:N13)","v":0},{"$f":"SUM(O11:O13)","v":23},0,null,{"$f":"SUM(R11:R13)","v":0}]
[null,"Ryzyko przejścia, emisje gazów cieplarnianych","SCOPE 1 Emisja gazów cieplarnianych (w tonach ekwiwalentu CO2) - całkowita oraz na 1 mln PLN przychodu (jeśli dostępne) - za ostatnie 3 lata\nFORMA ODPOWIEDZI:\nWartości liczbowe / brak danych"]
[null,null,"SCOPE 2  Emisja gazów cieplarnianych (w tonach ekwiwalentu CO2) - całkowita oraz na 1 mln PLN przychodu (jeśli dostępne) - za ostatnie 3 lata\nFORMA ODPOWIEDZI:\nWartości liczbowe / brak danych"]
[null,"Ryzyko fizyczne, ryzyko chroniczne","Czy Kredytobiorca doświadczył negatywnego wpływu (w aspekcie finansowym) chronicznego ryzyka fizycznego związanego ze zmianą klimatu w ciągu ostatnich 3 lat?",null,null,null,{"$f":"IF(F6=\"BRAK KONIECZNOŚCI PRZEPROWADZENIA ANALIZY ISTOTNOŚCI RYZYKA ESG\",\"nie dotyczy\",IF(F17=\"TAK\",1,(IF(F17=\"NIE\",0,\"\"))))","v":""}]
[]
[null,"Ryzyko fizyczne, ryzyko nagłe","Czy Kredytobiorca doświadczył negatywnego wpływu (w aspekcie finansowym) nagłego ryzyka fizycznego związanego ze zmianą klimatu w ciągu ostatnich 3 lat?",null,null,null,{"$f":"IF(F6=\"BRAK KONIECZNOŚCI PRZEPROWADZENIA ANALIZY ISTOTNOŚCI RYZYKA ESG\",\"nie dotyczy\",IF(F19=\"TAK\",1,(IF(F19=\"NIE\",0,\"\"))))","v":""}]
[]
{"$rows_left_out":110}
{"sheet":"Progi istotności","index":2,"n_rows":11,"n_cols":11,"rows_kept":11,"cut":false,"hidden":true,"merged":[[5,4,7,4],[5,5,8,5]]}
[null,"ARKUSZ STANOWI TYLKO PRZYKŁAD ILUSTRACYJNY - OSTATECZNE PROGI ISTOTNOŚCI DO DECYZJI BANKU"]
[null,null,null,null,null,null,null,"Punkt odniesienia dla progów istotności dla niektórych pytań dla klienta dużego"]
[]
[null,null,null,"Próg istotności (do wyboru przez Bank):","jednostka:","Identyfikacja podwyższonego ryzyka ESG:",{"$f":"IF(G2=\"BRAK PODWYŻSZONEGO RYZYKA ESG\",\"N/A\",IF(OR(G2=\"NIEKOMPLETNE DANE\",G2=\"BRAK PODWYŻSZONEGO RYZYKA ESG\"),\"N/A\",IF(OR(I7=3,I7=2),IF(#REF!>='Progi istotności'!D5,\"Podwyższone ryzyko\",\"N/A\"),IF(OR(#REF!>='Progi istotności'!D7,#REF!>='Progi istotności'!D10),\"Podwyższone ryzyko\",\"N/A\"))))","v":{"$error":"#REF!"}},"#","WSKAŹNIK ESG ","Progi","Komentarz"]
[null,"Klienci średni, mali, mikro:","E, S i G:",2,"pkt. ryzyka ESG","Przypisanie klientowi co najmniej takiej liczby punktów ryzyka ESG jak wskazano w komórce D5",null,3,"SCOPE 1 Emisja gazów cieplarnianych (w tonach ekwiwalentu CO2) - całkowita oraz na 1 mln PLN przychodu (jeśli dostępne) - za ostatnie 3 lata","Średnia z 3 lat przekracza <250-400> ton CO2 na 1 mln PLN przychodu","https://sciencebasedtargets.org/resources/legacy/2014/10/p120329-Randers-on-GEVA-Energy-Policy-color.pdf\n (str. 20 - przeliczone na PLN) Rekomendujemy backtesting tych progów w odniesieniu do rzeczywistych odpowiedzi pozyskiwanych od klientów."]
[null,"Klienci duzi:","E:",0.3,"% punktów ryzyka na maksymalną możliwą liczbę do uzyskania (z wyłączenie punktów za kontrowersje ponieważ są ujmowane jako osobny czynnik podwyższający ryzyko ESG)","Przypisanie klientowi co najmniej tylu punktów za kontrowersje ile wskazano w komórce D10 LUB przypisanie klientowi w obszarze E lub S lub G liczby punktów ESG przekraczających progi procentowe wskazane w komórkach D7, D8, D9",null,4,"SCOPE 2  Emisja gazów cieplarnianych (w tonach ekwiwalentu CO2) - całkowita oraz na 1 mln PLN przychodu (jeśli dostępne) - za ostatnie 3 lata","Średnia z 3 lat przekracza <50-100> ton CO2 na 1 mln PLN przychodu","https://sciencebasedtargets.org/resources/legacy/2014/10/p120329-Randers-on-GEVA-Energy-Policy-color.pdf\n (str. 20 - przeliczone na PLN) Rekomendujemy backtesting tych progów w odniesieniu do rzeczywistych odpowiedzi pozyskiwanych od klientów."]
[null,null,"S:",0.3,null,null,null,6,"Koszty nabywania uprawnień do emisji CO2 w EU ETS na 1 mln PLN przychodu (jeśli dostępne) - za ostatnie 3 lata","Średnia z 3 lat przekracza <10 tys. PLN - 50 tys. PLN> na 1 mln PLN przychodu (do decyzji Banku)","Efektywnie 1%-5% przychodu, w tym obszarze dane są trudno dostępne, proponujemy określenie istotności w kontekście poziomu, który może być istotny dla wskaźników finansowych w analizie zdolności kredytowej.  Rekomendujemy backtesting tych progów w odniesieniu do rzeczywistych odpowiedzi pozyskiwanych od klientów."]
[null,null,"G:",0.5,null,null,null,7,"Zużycie a energii elektrycznej (MWh) na 1 mln PLN przychodu - za ostatnie 3 lata","Średnia z 3 lat przekracza 10-15 MWh na 1 mln PLN przychodu (do decyzji Banku)","Dane są trudno dostępne. Oszacowano na bazie raportów CSR wybranych spółek. Rekomendujemy backtesting tych progów w odniesieniu do rzeczywistych odpowiedzi pozyskiwanych od klientów."]
[null,null,"Kontrowersje:",2,"pkt. ryzyka ESG",null,null,8,"Zużycie wody (w m3) na 1 mln PLN przychodu - za ostatnie 3 lata","Średnia z 3 lat przekracza <150-200> m3 na 1 mln PLN przychodu","Dane są trudno dostępne. Oszacowano na bazie raportów CSR wybranych spółek. Rekomendujemy backtesting tych progów w odniesieniu do rzeczywistych odpowiedzi pozyskiwanych od klientów."]
[null,null,null,null,null,null,null,9,"Czy Kredytobiorca korzysta z energii elektrycznej pochodzącej z odnawialnych źródeł energii (przynajmniej X% zużycia EE)?","Średnia z 3 lat przekracza <5% - 10%>\n(do decyzji Banku)","Udział energii z OZE w elektroenergetyce (w zużyciu EE końcowym brutto) wyniósł 14,35% w 2019 r. w Polsce.\nhttps://stat.gov.pl/obszary-tematyczne/srodowisko-energia/energia/energia-ze-zrodel-odnawialnych-w-2019-roku,3,14.html\nRekomendujemy backtesting tych progów w odniesieniu do rzeczywistych odpowiedzi pozyskiwanych od klientów."]
[null,null,null,null,null,null,null,12,"Proszę wskazać szacowane negatywne skutki finansowe ryzyka fizycznego zmiany klimatu jako % przychodu w ostatnich 3 latach","Średnia z 3 lat przekracza <10 %- 20%>\n(do decyzji Banku)","W tym obszarze dane są trudno dostępne, proponujemy określenie istotności w kontekście poziomu, który może być istotny dla wskaźników finansowych w analizie zdolności kredytowej. W wyniku backtestu ankiet po pewnym czasie z ich korzystania rekomendujemy zweryfikowanie zasadności progów. Rekomendujemy backtesting tych progów w odniesieniu do rzeczywistych odpowiedzi pozyskiwanych od klientów."]

{"sheet":"AMA","index":3,"n_rows":75,"n_cols":4,"rows_kept":75,"cut":false,"hidden":true,"merged":[]}
["Kategoria","Pytanie","Wynik","PUNKTY ESG"]
["FORMULARZ KLIENTA","WYNIK OCENY ISTOTNOŚCI RYZYKA ",{"$f":"ESG!G2","v":"UZUPEŁNIJ FORMULARZ KLIENTA"}]
["FORMULARZ KLIENTA","Nazwa klienta",{"$f":"ESG!$C$3","v":0}]
["FORMULARZ KLIENTA","REGON",{"$f":"ESG!$C$4","v":0}]
["FORMULARZ KLIENTA","Data wniosku",{"$f":"ESG!$C$5","v":"00:00:00"}]
["FORMULARZ KLIENTA","Pracownik wypełniający",{"$f":"ESG!$C$6","v":0}]
["FORMULARZ KLIENTA","Segment klienta",{"$f":"ESG!$C$7","v":0}]
["FORMULARZ KLIENTA","nr PKD",{"$f":"ESG!$C$8","v":0}]
["FORMULARZ KLIENTA","PKD wiodącej działalności gospodarczej",{"$f":"ESG!$C$9","v":0}]
["FORMULARZ KLIENTA","Czy branża charakteryzuje się podwyższonym ryzykiem ESG?",{"$f":"ESG!$C$10","v":"b.d."}]
["WYNIK OCENY ISTOTNOŚCI RYZYKA ESG","Ryzyko środowiskowe (\"E\")",{"$f":"ESG!$G$3","v":"nie dotyczy"}]
["WYNIK OCENY ISTOTNOŚCI RYZYKA ESG","Ryzyko społeczne (\"S\")",{"$f":"ESG!$G$4","v":"nie dotyczy"}]
["WYNIK OCENY ISTOTNOŚCI RYZYKA ESG","Ryzyko związane z zarządzaniem (\"G\")",{"$f":"ESG!$G$5","v":"nie dotyczy"}]
["Wskaźniki do pobrania na potrzeby ujawnień III filara:","SCOPE 1 Emisja gazów cieplarnianych (w tonach ekwiwalentu CO2) - całkowita oraz na 1 mln PLN przychodu (jeśli dostępne) - za ostatnie 3 lata",{"$f":"ESG!$F$15","v":0}]
["Wskaźniki do pobrania na potrzeby ujawnień III filara:","SCOPE 2  Emisja gazów cieplarnianych (w tonach ekwiwalentu CO2) - całkowita oraz na 1 mln PLN przychodu (jeśli dostępne) - za ostatnie 3 lata",{"$f":"ESG!$F$16","v":0}]
["Wskaźniki do pobrania na potrzeby ujawnień III filara:","Czy Kredytobiorca doświadczył negatywnego wpływu (w aspekcie finansowym) chronicznego ryzyka fizycznego związanego ze zmianą klimatu w ciągu ostatnich 3 lat?",{"$f":"ESG!$F$17","v":0},{"$f":"ESG!$G$17","v":""}]
["Wskaźniki do pobrania na potrzeby ujawnień III filara:","wpływ zmiany temperatury (powietrrze, wody słodkie / morskie)",{"$f":"ESG!$J$18","v":0}]
["Wskaźniki do pobrania na potrzeby ujawnień III filara:","wpływ niestandardowo wysokich temperatur / rozmarzanie wiecznej zmarzliny",{"$f":"ESG!$K$18","v":0}]
["Wskaźniki do pobrania na potrzeby ujawnień III filara:","wpływ zmiany rozkładu i typów odpadów (deszcz, grad, śnieg / lód)",{"$f":"ESG!$L$18","v":0}]
["Wskaźniki do pobrania na potrzeby ujawnień III filara:","wpływ podnoszenia się poziomu mórz",{"$f":"ESG!$M$18","v":0}]
{"$rows_left_out":56}
{"sheet":"PKD","index":4,"n_rows":656,"n_cols":4,"rows_kept":656,"cut":false,"hidden":false,"merged":[]}
["Lista PKD","Czy branża podwyższonego ryzyka","nr PKD","nazwa PKD"]
["01.11.Z Uprawa zbóż, roślin strączkowych i roślin oleistych na nasiona, z wyłączeniem ryżu","TAK","01.11.Z","Uprawa zbóż, roślin strączkowych i roślin oleistych na nasiona, z wyłączeniem ryżu"]
["01.12.Z Uprawa ryżu","TAK","01.12.Z","Uprawa ryżu"]
["01.13.Z Uprawa warzyw, włączając melony oraz uprawa roślin korzeniowych i roślin bulwiastych","TAK","01.13.Z","Uprawa warzyw, włączając melony oraz uprawa roślin korzeniowych i roślin bulwiastych"]
["01.14.Z Uprawa trzciny cukrowej","TAK","01.14.Z","Uprawa trzciny cukrowej"]
["01.15.Z Uprawa tytoniu","TAK","01.15.Z","Uprawa tytoniu"]
["01.16.Z Uprawa roślin włóknistych","TAK","01.16.Z","Uprawa roślin włóknistych"]
["01.19.Z Pozostałe uprawy rolne inne niż wieloletnie","TAK","01.19.Z","Pozostałe uprawy rolne inne niż wieloletnie"]
["01.21.Z Uprawa winogron","TAK","01.21.Z","Uprawa winogron"]
["01.22.Z Uprawa drzew i krzewów owocowych tropikalnych i podzwrotnikowych","TAK","01.22.Z","Uprawa drzew i krzewów owocowych tropikalnych i podzwrotnikowych"]
["01.23.Z Uprawa drzew i krzewów owocowych cytrusowych","TAK","01.23.Z","Uprawa drzew i krzewów owocowych cytrusowych"]
["01.24.Z Uprawa drzew i krzewów owocowych ziarnkowych i pestkowych","TAK","01.24.Z","Uprawa drzew i krzewów owocowych ziarnkowych i pestkowych"]
["01.25.Z Uprawa pozostałych drzew i krzewów owocowych oraz orzechów","TAK","01.25.Z","Uprawa pozostałych drzew i krzewów owocowych oraz orzechów"]
["01.26.Z Uprawa drzew oleistych","TAK","01.26.Z","Uprawa drzew oleistych"]
["01.27.Z Uprawa roślin wykorzystywanych do produkcji napojów","TAK","01.27.Z","Uprawa roślin wykorzystywanych do produkcji napojów"]
["01.28.Z Uprawa roślin przyprawowych i aromatycznych oraz roślin wykorzystywanych do produkcji leków i wyrobów farmaceutycznych","TAK","01.28.Z","Uprawa roślin przyprawowych i aromatycznych oraz roślin wykorzystywanych do produkcji leków i wyrobów farmaceutycznych"]
["01.29.Z Uprawa pozostałych roślin wieloletnich","TAK","01.29.Z","Uprawa pozostałych roślin wieloletnich"]
["01.30.Z Rozmnażanie roślin","NIE","01.30.Z","Rozmnażanie roślin"]
["01.41.Z Chów i hodowla bydła mlecznego","TAK","01.41.Z","Chów i hodowla bydła mlecznego"]
["01.42.Z Chów i hodowla pozostałego bydła i bawołów","TAK","01.42.Z","Chów i hodowla pozostałego bydła i bawołów"]
{"$rows_left_out":637}
{"sheet":"Słowniki","index":5,"n_rows":5,"n_cols":9,"rows_kept":5,"cut":false,"hidden":true,"merged":[]}
[]
["duży","TAK","TAK - SCOPE 1","brak danych","TAK",null,"kryterium A",null,"kryterium A"]
["średni","NIE","TAK - SCOPE 2","kryterium A","NIE",null,"kryterium A i B",null,"kryterium A i B"]
["mały/mikro",null,"TAK - SCOPE 1 i 2","kryterium B","nie dotyczy",null,"kryterium C",null,"kryterium C"]
[null,null,"NIE",null,null,null,null,null,"brak danych"]

{"sheet":"EBRD_PKD_ESG risk","index":6,"n_rows":410,"n_cols":10,"rows_kept":410,"cut":false,"hidden":true,"merged":[[408,5,408,8],[319,5,319,8],[326,5,326,8],[330,5,330,8],[334,5,334,8],[342,5,342,8],[387,5,387,8],[389,5,389,8],[391,5,391,8],[395,5,395,8],[400,5,400,8],[405,5,405,8],[316,5,316,8],[0,4,0,8],[1,4,1,5],[1,6,1,8],[3,5,3,8],[41,5,41,8],[63,5,63,8],[219,5,219,8],[231,5,231,8],[244,5,244,8],[257,5,257,8],[298,5,298,8]]}
[null,null,null,null,"EBRD Environmental and Social Risk Categorisation\nList – Revised 2014"]
[null,null,null,null,null,null,"Risk Level"]
["PKD level","PKD code","PKD code for vlookup to PL version","PKD description","Code NACE Rev. 2","Category and Subcategory","Environmental","Social","Overall","Czy ryzyko ESG potencjalnie podwyższone (co najmniej 1 exluded LUB co najmniej 1 high LUB 2 medium)?"]
["1","A","A","AGRICULTURE, FORESTRY, HUNTING AND FISHING","A","Agriculture, forestry and fishing"]
["2","1","01","CROP AND ANIMAL PRODUCTION, HUNTING, INCLUDING SERVICE ACTIVITIES",1,"Crop and animal production, hunting and related service activities",null,null,null,{"$f":"IF(I5=\"\",\"\",IF(OR(AND(G5=\"medium\",H5=\"medium\"),G5=\"high\",H5=\"high\",G5=\"excluded\",H5=\"excluded\"),\"TAK\",\"NIE\"))","v":""}]
["3","1.1","01.1","Growing of non-perennial crops","1.1","Growing of non-perennial crops",null,null,null,{"$f":"IF(I6=\"\",\"\",IF(OR(AND(G6=\"medium\",H6=\"medium\"),G6=\"high\",H6=\"high\",G6=\"excluded\",H6=\"excluded\"),\"TAK\",\"NIE\"))","v":""}]
["4","1.11","01.11","Growing of cereals, leguminous crops and oil plants, for seeds, except rice","1.11","Growing of cereals (except rice), leguminous crops and oil seeds","Medium","High","Medium","TAK"]
["4","1.12","01.12","Growing of rice","1.12","Growing of rice","Medium","High","High","TAK"]
["4","1.13","01.13","Growing of vegetables, including melons, and growing of roots and tubers","1.13","Growing of vegetables and melons, roots and tubers","Medium","High","High","TAK"]
["4","1.14","01.14","Growing of sugar cane","1.14","Growing of sugar cane","Medium","High","High","TAK"]
["4","1.15","01.15","Growing of tobacco","1.15","Growing of tobacco\nNote: This activity is typically excluded from financing using EBRD funds – check your agreement with EBRD for details.","Excluded","Excluded","Excluded","TAK"]
["4","1.16","01.16","Growing of fibre crops","1.16","Growing of fibre crops (e.g. jute, flax, hemp, cotton)","Medium","High","High","TAK"]
["4","1.19","01.19","Growing of other non-perennial crops","1.19","Growing of other non-perennial crops, e.g. growing of flowers, flower seeds,  production of cut flowers and flower buds, etc.","Medium","High","High","TAK"]
["3","1.2","01.2","Growing of perennial crops","1.2","Growing of perennial crops (i.e. plants that last for more than two growing seasons, e.g. grapes, tropical and subtropical fruits, citrus fruits, bush fruits and nuts, apples, cherries, etc.)","Medium","High","High","TAK"]
["3","1.3","01.3","Plant propagation","1.3","Plant propagation (e.g. growing of plants for planting, ornamental purposes, including turf for transplanting, etc.)","Low","Low","Low","NIE"]
["3","1.4","01.4","Animal production","1.4","Animal products",null,null,null,""]
["4","1.41","01.41","Raising of dairy cattle","1.41","Raising of dairy cattle","Medium","Medium","Medium","TAK"]
["4","1.42","01.42","Raising of other cattle and buffaloes","1.42","Raising of other cattle and buffaloes","Medium","Medium","Medium","TAK"]
["4","1.43","01.43","Raising of horses and other equines","1.43","Raising of horses and other equines","Medium","Medium","Medium","TAK"]
["4","1.44","01.44","Raising of camels and camelids","1.44","Raising of camels and camelids","Medium","Medium","Medium","TAK"]
{"$rows_left_out":390}